{"text_format":"1","workbook":"xlsx","n_sheets":2,"sheets":["Form","Keywords"],"not_rendered":{"charts":0,"images":1,"macros":1,"external_links":0,"defined_names":1,"comments":0,"pivot_tables":0},"unopened":[],"bounds":{"document_bytes":16777216,"sheet_cells":100000,"rows_first":2000,"rows_last":500,"rows_between":2000,"halvings":0,"cell_chars":16384,"cell_head_chars":4096},"cells_cut":0,"cells_raw":0,"read":"whole","date_system":"1900"}

{"sheet":"Form","index":0,"n_rows":42,"n_cols":10,"rows_kept":42,"cut":false,"hidden":false,"merged":[[351,3,351,4],[346,3,346,4],[347,3,347,4],[348,3,348,4],[349,3,349,4],[350,3,350,4],[341,3,341,4],[342,3,342,4],[343,3,343,4],[344,3,344,4],[345,3,345,4],[336,3,336,4],[337,3,337,4],[338,3,338,4],[339,3,339,4],[340,3,340,4],[331,3,331,4],[332,3,332,4],[333,3,333,4],[334,3,334,4],[335,3,335,4],[326,3,326,4],[327,3,327,4],[328,3,328,4],[329,3,329,4],[330,3,330,4],[321,3,321,4],[322,3,322,4],[323,3,323,4],[324,3,324,4],[325,3,325,4],[316,3,316,4],[317,3,317,4],[318,3,318,4],[319,3,319,4],[320,3,320,4],[311,3,311,4],[312,3,312,4],[313,3,313,4],[314,3,314,4],[315,3,315,4],[306,3,306,4],[307,3,307,4],[308,3,308,4],[309,3,309,4],[310,3,310,4],[301,3,301,4],[302,3,302,4],[303,3,303,4],[304,3,304,4],[305,3,305,4],[296,3,296,4],[297,3,297,4],[298,3,298,4],[299,3,299,4],[300,3,300,4],[291,3,291,4],[292,3,292,4],[293,3,293,4],[294,3,294,4],[295,3,295,4],[286,3,286,4],[287,3,287,4],[288,3,288,4],[289,3,289,4],[290,3,290,4],[281,3,281,4],[282,3,282,4],[283,3,283,4],[284,3,284,4],[285,3,285,4],[276,3,276,4],[277,3,277,4],[278,3,278,4],[279,3,279,4],[280,3,280,4],[271,3,271,4],[272,3,272,4],[273,3,273,4],[274,3,274,4],[275,3,275,4],[266,3,266,4],[267,3,267,4],[268,3,268,4],[269,3,269,4],[270,3,270,4],[261,3,261,4],[262,3,262,4],[263,3,263,4],[264,3,264,4],[265,3,265,4],[256,3,256,4],[257,3,257,4],[258,3,258,4],[259,3,259,4],[260,3,260,4],[251,3,251,4],[252,3,252,4],[253,3,253,4],[254,3,254,4],[255,3,255,4],[246,3,246,4],[247,3,247,4],[248,3,248,4],[249,3,249,4],[250,3,250,4],[241,3,241,4],[242,3,242,4],[243,3,243,4],[244,3,244,4],[245,3,245,4],[236,3,236,4],[237,3,237,4],[238,3,238,4],[239,3,239,4],[240,3,240,4],[231,3,231,4],[232,3,232,4],[233,3,233,4],[234,3,234,4],[235,3,235,4],[226,3,226,4],[227,3,227,4],[228,3,228,4],[229,3,229,4],[230,3,230,4],[221,3,221,4],[222,3,222,4],[223,3,223,4],[224,3,224,4],[225,3,225,4],[216,3,216,4],[217,3,217,4],[218,3,218,4],[219,3,219,4],[220,3,220,4],[211,3,211,4],[212,3,212,4],[213,3,213,4],[214,3,214,4],[215,3,215,4],[206,3,206,4],[207,3,207,4],[208,3,208,4],[209,3,209,4],[210,3,210,4],[201,3,201,4],[202,3,202,4],[203,3,203,4],[204,3,204,4],[205,3,205,4],[196,3,196,4],[197,3,197,4],[198,3,198,4],[199,3,199,4],[200,3,200,4],[191,3,191,4],[192,3,192,4],[193,3,193,4],[194,3,194,4],[195,3,195,4],[186,3,186,4],[187,3,187,4],[188,3,188,4],[189,3,189,4],[190,3,190,4],[181,3,181,4],[182,3,182,4],[183,3,183,4],[184,3,184,4],[185,3,185,4],[176,3,176,4],[177,3,177,4],[178,3,178,4],[179,3,179,4],[180,3,180,4],[171,3,171,4],[172,3,172,4],[173,3,173,4],[174,3,174,4],[175,3,175,4],[166,3,166,4],[167,3,167,4],[168,3,168,4],[169,3,169,4],[170,3,170,4],[161,3,161,4],[162,3,162,4],[163,3,163,4],[164,3,164,4],[165,3,165,4],[156,3,156,4],[157,3,157,4],[158,3,158,4],[159,3,159,4],[160,3,160,4],[151,3,151,4],[152,3,152,4],[153,3,153,4],[154,3,154,4],[155,3,155,4],[146,3,146,4],[147,3,147,4],[148,3,148,4],[149,3,149,4],[150,3,150,4],[141,3,141,4],[142,3,142,4],[143,3,143,4],[144,3,144,4],[145,3,145,4],[136,3,136,4],[137,3,137,4],[138,3,138,4],[139,3,139,4],[140,3,140,4],[131,3,131,4],[132,3,132,4],[133,3,133,4],[134,3,134,4],[135,3,135,4],[126,3,126,4],[127,3,127,4],[128,3,128,4],[129,3,129,4],[130,3,130,4],[121,3,121,4],[122,3,122,4],[123,3,123,4],[124,3,124,4],[125,3,125,4],[116,3,116,4],[117,3,117,4],[118,3,118,4],[119,3,119,4],[120,3,120,4],[111,3,111,4],[112,3,112,4],[113,3,113,4],[114,3,114,4],[115,3,115,4],[106,3,106,4],[107,3,107,4],[108,3,108,4],[109,3,109,4],[110,3,110,4],[101,3,101,4],[102,3,102,4],[103,3,103,4],[104,3,104,4],[105,3,105,4],[96,3,96,4],[97,3,97,4],[98,3,98,4],[99,3,99,4],[100,3,100,4],[91,3,91,4],[92,3,92,4],[93,3,93,4],[94,3,94,4],[95,3,95,4],[86,3,86,4],[87,3,87,4],[88,3,88,4],[89,3,89,4],[90,3,90,4],[81,3,81,4],[82,3,82,4],[83,3,83,4],[84,3,84,4],[85,3,85,4],[76,3,76,4],[77,3,77,4],[78,3,78,4],[79,3,79,4],[80,3,80,4],[71,3,71,4],[72,3,72,4],[73,3,73,4],[74,3,74,4],[75,3,75,4],[66,3,66,4],[67,3,67,4],[68,3,68,4],[69,3,69,4],[70,3,70,4],[61,3,61,4],[62,3,62,4],[63,3,63,4],[64,3,64,4],[65,3,65,4],[56,3,56,4],[57,3,57,4],[58,3,58,4],[59,3,59,4],[60,3,60,4],[51,3,51,4],[52,3,52,4],[53,3,53,4],[54,3,54,4],[55,3,55,4],[46,3,46,4],[47,3,47,4],[48,3,48,4],[49,3,49,4],[50,3,50,4],[30,3,30,4],[31,0,31,1],[31,3,31,4],[1,2,1,7],[29,0,29,1],[29,3,29,4],[5,6,5,7],[3,4,3,5],[4,4,4,5],[5,4,5,5],[6,4,6,5],[7,4,7,5],[26,0,26,1],[41,0,44,7],[45,0,45,7],[11,0,11,1],[12,0,12,1],[3,0,3,1],[5,0,5,1],[39,0,39,1],[35,0,35,1],[35,3,35,4],[3,2,3,3],[25,3,25,4],[27,0,27,1],[24,2,24,5],[26,3,26,4],[28,3,28,4],[27,3,27,4],[30,0,30,1],[40,0,40,7],[14,0,14,7],[24,0,24,1],[32,0,32,1],[36,0,36,1],[37,3,37,4],[25,0,25,1],[23,0,23,1],[16,4,16,5],[17,4,17,5],[18,4,18,5],[19,4,19,5],[20,4,20,5],[21,4,21,5],[15,4,15,5],[39,3,39,4],[38,3,38,4],[36,3,36,4],[34,0,34,7],[32,3,32,4],[33,3,33,4],[33,0,33,1],[37,0,37,1],[23,3,23,4],[0,0,0,7],[8,0,8,7],[22,0,22,7],[4,0,4,1],[6,0,6,1],[2,0,2,7],[10,2,10,5],[4,2,4,3],[6,6,6,7],[10,0,10,1],[1,0,1,1],[5,2,5,3],[6,2,6,3],[9,3,9,4],[11,3,11,4],[12,3,12,4],[7,6,7,7],[13,1,13,5],[9,0,9,1],[7,2,7,3],[7,0,7,1],[4,6,4,7],[3,6,3,7]]}
["      TEMPORARY EMPLOYMENT CHANGE REQUEST FORM"]
["                                                                                                                 ",null,"This form is to make changes to the existing student and non - student work assignments. New assignments are to be submitted via either an EPAF (Electronic Personnel Action Form) or an appropriate paper form."]
["EMPLOYEE INFORMATION"]
[]
["UNC CHARLOTTE ID#*",null,"800820122"]
[]
["LAST NAME:*",null,"Ekis",null,"FIRST NAME:*",null,"Sarah"]
[]
["REASON FOR REQUEST"]
[]
["REQUEST CHANGE REASON:*",null,"Separation/Termination"]
[]
[]
[null,{"$f":"IF($C$11=Keywords!$A$2,Keywords!$B$2,IF($C$11=Keywords!$A$3,Keywords!$B$3,IF($C$11=Keywords!$A$4,Keywords!$B$4,IF($C$11=Keywords!$A$5,Keywords!$B$5,IF($C$11=Keywords!$A$6,Keywords!$B$6,\"\")))))","v":"Please enter last day worked in EFFECTIVE DATE OF CHANGE field under department information section"}]
["CHANGE INFORMATION"]
[]
[]
[{"$f":"IF(C11=Keywords!A4,Keywords!H4,\"\")","v":""},null,{"$f":"IF(C11=Keywords!A5,Keywords!H8,\"\")","v":""}]
[{"$f":"IF(C11=Keywords!A4,Keywords!H7,\"\")","v":""},null,{"$f":"IF(C11=Keywords!A5,Keywords!H5,\"\")","v":""}]
[null,null,{"$f":"IF(C11=Keywords!A3,Keywords!H2,\"\")","v":""},null,null,null,null,null,null," "]
[{"$f":"IF(C11=Keywords!A2,Keywords!H3,\"\")","v":""},null,{"$f":"IF(C11=Keywords!A3,Keywords!H10,\"\")","v":""}]
[{"$f":"IF(C11=Keywords!A2,Keywords!H6,\"\")","v":""}]
["DEPARTMENT INFORMATION"]
[]
["DEPARTMENT:*",null,"Classification/Compensation",null,null,null,"DEPT CODE :",{"$f":"VLOOKUP(C25,Keywords!C1:D301,2,FALSE)","v":13400},null," "]
[]
["EFFECTIVE DATE OF CHANGE:*",null,"2023-06-02"]
[]
["JOB POSITION NUMBER: *",null,"STMP15","                   SUFFIX**",null,"01"]
[]
["POSITION TITLE: *",null,"HRManager"]
[]
["SUPERVISOR: *",null,"Deidra Harris","SUPERVISOR EXT :*",null,71433]
[]
["SIGNATURES"]
[]
["PREPARER SIGNATURE:",null,"Sarah Ekis","PREPARER NAME :*",null,"Sarah Ekis","DATE SIGNED:","2023-05-29"]
[]
["EMPLOYMENT OFFICE SIGNATURE:",null,"","HR NAME :",null,""," DATE SIGNED:",""]
[]
["COMMENTS"]
["Separation"]

{"sheet":"Keywords","index":1,"n_rows":281,"n_cols":9,"rows_kept":281,"cut":false,"hidden":false,"merged":[]}
["*Select Change Reason*","Messages","* Select Department*","Dept #","*Select Pos#*","Pay Status","FTE","Options","*Select Suffix Code*"]
["Change Fund Number","Please enter new fund and list old fund number","49er Card Services",11000,"STU070","Hourly","1 hr -.025","NEW FTE:*","00"]
["Change FTE (work hours per week)","Please enter new FTE for work hours and list old FTE","Academic Affairs VC",15100,"STU072","Stipend","2 hrs -.05","NEW FUND :*","01"]
["Change Pay Rate","Please enter new hourly rate and list old rate .Also please note that pay rate would be effective from first day of the following month.","Academic Diversity & Inclusion",28000,"STU130","Stipend","3 hrs -.075","NEW PAY RATE :*","02"]
["Change Stipend Amount","Please enter new stipend amount and list old amount","Advance Fado",13301,"UPIP070","Hourly","4 hrs -.1","OLD STIPEND AMOUNT:*","03"]
["Separation/Termination","Please enter last day worked in EFFECTIVE DATE OF CHANGE field under department information section","Advancement Data",30625,"FWSA2X","Hourly","5 hrs -.125","OLD FUND :*","04"]
[null,null,"Aerospace Studies",15500,"STMP15","Hourly","6 hrs -.15","OLD PAY RATE :*","05"]
[null,null,"Africana Studies",17100,"STMP18","Stipend","7 hrs -.175","NEW STIPEND AMOUNT:*","06"]
[null,null,"AISLE",28350,null,null,"8 hrs -.2","EFFECTIVE DATE OF CHANGE : ","07"]
[null,null,"Alumni Affairs",30300,null,null,"9 hrs -.225","OLD FTE :*","08"]
[null,null,"American Studies",16400,null,null,"10 hrs -.25",null,"09"]
[null,null,"Animal Care Facilities",24500,null,null,"11 hrs -.275",null,"10"]
[null,null,"Annual Giving",30665,null,null,"12 hrs -.3",null,"11"]
[null,null,"Anthropology",19350,null,null,"13 hrs -.325",null,"12"]
[null,null,"Art & Art History",17800,null,null,"14 hrs -.35",null,"13"]
[null,null,"Assessment and Accreditation",15160,null,null,"15 hrs -.375",null,"14"]
[null,null,"Athletic Academic Center",28300,null,null,"16 hrs -.4",null,"15"]
[null,null,"Athletics - Coed Sports",31950,null,null,"17 hrs -.425",null,"16"]
[null,null,"Athletics - Men's Sports",30950,null,null,"18 hrs -.45",null,"17"]
[null,null,"Athletics - Women's Sports",31450,null,null,"19 hrs -.475",null,"18"]
[null,null,"Athletics Admin/Support",30900,null,null,"20 hrs -.5",null,"19"]
[null,null,"Athletics Facility Operations",30901,null,null,null,null,"20"]
[null,null,"Automotive",14600,null,null,null,null,"21"]
[null,null,"Auxiliary Operations",10500,null,null,null,null,"22"]
[null,null,"Belk Gym",29600,null,null,null,null,"23"]
[null,null,"Benefits",13300,null,null,null,null,"24"]
[null,null,"Bioinformatics and Genomics",23270,null,null,null,null,"25"]
[null,null,"Biological Sciences",17200,null,null,null,null,"26"]
[null,null,"Bookstore",10700,null,null,null,null,"27"]
[null,null,"Budget",11500,null,null,null,null,"28"]
[null,null,"Building Environmental Services",14800,null,null,null,null,"29"]
[null,null,"Business Affairs VC",10300,null,null,null,null,"30"]
[null,null,"Business Info Systems/Operations",20000,null,null,null,null,"31"]
[null,null,"Business Services AVC",10400,null,null,null,null,"32"]
[null,null,"Campus Activity Board",29210,null,null,null,null,"33"]
[null,null,"CBES",21700,null,null,null,null,"34"]
[null,null,"Center City",13915,null,null,null,null,"35"]
[null,null,"Center City Campus",15175,null,null,null,null,"36"]
[null,null,"Center for Appl Geo Info Sys",26450,null,null,null,null,"37"]
[null,null,"Center for Ethics",18700,null,null,null,null,"38"]
[null,null,"Center for Precision Metrology",23700,null,null,null,null,"39"]
[null,null,"Center for Research Excellence",24450,null,null,null,null,"40"]
[null,null,"Center of Real Estate",19850,null,null,null,null,"41"]
[null,null,"Chancellor",10000,null,null,null,null,"42"]
[null,null,"Charlotte Teacher Early College",20350,null,null,null,null,"43"]
[null,null,"Charlotte Teacher's Institute",15400,null,null,null,null,"44"]
[null,null,"Chemistry",17400,null,null,null,null,"45"]
[null,null,"Civil and Environmental Engr",22200,null,null,null,null,"46"]
[null,null,"Classification/Compensation",13400,null,null,null,null,"47"]
[null,null,"Coed Cheerleaders",32100,null,null,null,null,"48"]
[null,null,"Coed Dance Team",32200,null,null,null,null,"49"]
[null,null,"Coed General Sports",32300,null,null,null,null,"50"]
[null,null,"Coed Track/Cross Country",32000,null,null,null,null,"51"]
[null,null,"Col of Arts & Architecture",15210,null,null,null,null,"52"]
[null,null,"College of Business",19400,null,null,null,null,"53"]
[null,null,"College of Computing & Informatics",23000,null,null,null,null,"54"]
[null,null,"College of Education",20300,null,null,null,null,"55"]
[null,null,"College of Engineering",21300,null,null,null,null,"56"]
[null,null,"College of Health & Human Svc",22300,null,null,null,null,"57"]
[null,null,"College of Liberal Arts & Sciences",15300,null,null,null,null,"58"]
[null,null,"Communication Studies",17500,null,null,null,null,"59"]
[null,null,"Community Relations",30660,null,null,null,null,"60"]
[null,null,"Computer Science",23200,null,null,null,null,"61"]
[null,null,"Cone Center Conferences",29140,null,null,null,null,"62"]
[null,null,"Cone Univ Center",29000,null,null,null,null,"63"]
[null,null,"Constituent Relations",30650,null,null,null,null,"64"]
[null,null,"Controller",11600,null,null,null,null,"65"]
[null,null,"Counseling",20950,null,null,null,null,"66"]
[null,null,"Counseling & Psychological Center",29900,null,null,null,null,"67"]
[null,null,"Creative Services",30670,null,null,null,null,"68"]
[null,null,"Criminal Justice and Criminology",17600,null,null,null,null,"69"]
[null,null,"Ctr For STEM Education",20800,null,null,null,null,"70"]
[null,null,"Ctr for Teaching and Learning",24205,null,null,null,null,"71"]
[null,null,"Dance",17710,null,null,null,null,"72"]
[null,null,"Dean of Students",28500,null,null,null,null,"73"]
[null,null,"Dept of Materials Management",12700,null,null,null,null,"74"]
[null,null,"Dining",10600,null,null,null,null,"75"]
[null,null,"Disability Services",27700,null,null,null,null,"76"]
[null,null,"Diversity & Inclusion",10225,null,null,null,null,"77"]
[null,null,"Donor Relations",30275,null,null,null,null,"78"]
[null,null,"DPT Writing, Rhet, Digital Studies",18050,null,null,null,null,"79"]
[null,null,"Economics",20200,null,null,null,null,"80"]
[null,null,"Editorial Services",30500,null,null,null,null,"81"]
[null,null,"Education Abroad",26900,null,null,null,null,"82"]
[null,null,"Education Research",20600,null,null,null,null,"83"]
[null,null,"Educational Leadership",20900,null,null,null,null,"84"]
[null,null,"Electrical & Computer Engineering",21900,null,null,null,null,"85"]
[null,null,"Employee Relations",13500,null,null,null,null,"86"]
[null,null,"Engineering Services",13902,null,null,null,null,"87"]
[null,null,"Engineering Tech & Constr Mgmt",21800,null,null,null,null,"88"]
[null,null,"English",18000,null,null,null,null,"89"]
[null,null,"English Language Training Institute",27000,null,null,null,null,"90"]
[null,null,"Enrollment Communications",27110,null,null,null,null,"91"]
[null,null,"Enrollment Management",27100,null,null,null,null,"92"]
[null,null,"Environmental Health & Safety",13800,null,null,null,null,"93"]
[null,null,"EPIC",22150,null,null,null,null,"94"]
[null,null,"Extended Academic Programs",26200,null,null,null,null,"95"]
[null,null,"Facilities Informal Projects",14010,null,null,null,null,"96"]
[null,null,"Facilities Management AVC",13900,null,null,null,null,"97"]
[null,null,"Facilities Management Lock Shop",14450,null,null,null,null,"98"]
[null,null,"Facilities Management Zone 5",14400,null,null,null,null,"99"]
[null,null,"Finance",19800]
[null,null,"Financial Aid Operations",30100]
[null,null,"Financial Services AVC",11400]
[null,null,"FM Architectural/Engineering",13930]
[null,null,"FM Central Operations",13975]
[null,null,"FM Dining Crew",14200]
[null,null,"FM Electrical Shop",14250]
[null,null,"FM Energy Conservation and Mgmt",14350]
[null,null,"FM Fire Systems",14550]
[null,null,"FM General Trades Shop",14700]
[null,null,"FM HVAC Shop",14105]
[null,null,"FM Maintenance Operations",13950]
[null,null,"FM Plumbing Shop",14102]
[null,null,"FM PM Crew",13925]
[null,null,"FM Portal Operations",14103]
[null,null,"FM Reserves",14011]
[null,null,"FM RUPS",14300]
[null,null,"FM Utility Operations",14360]
[null,null,"Geography and Earth Sciences",18100]
[null,null,"Global Studies",16600]
[null,null,"Graduate Admissions",24100]
[null,null,"Graduate Center",24000]
[null,null,"Graduate Prof Student Government",29220]
[null,null,"Graduate Programs",19600]
[null,null,"Graduate School",23900]
[null,null,"Grants & Contracts Administration",24550]
[null,null,"Greenhouse",17300]
[null,null,"Grounds",14500]
[null,null,"Health & Wellbeing",29950]
[null,null,"Health Services",30000]
[null,null,"History",18300]
[null,null,"Honors College",16900]
[null,null,"Hotel and Conference Center",30210]
[null,null,"Housing and Residence Life",29700]
[null,null,"Human Resources AVC",13200]
[null,null,"Industry and Government Partnership",23400]
[null,null,"Institutional Research",27800]
[null,null,"Intercultural & Educational Exper",26700]
[null,null,"Internal Audit",13100]
[null,null,"Internal/Operational Communications",30510]
[null,null,"International Programs",26500]
[null,null,"Intl Student/Scholar Office",26950]
[null,null,"Kinesiology",22700]
[null,null,"Lab School",21250]
[null,null,"Languages and Culture Studies",18400]
[null,null,"Leadership & Community Engagement",29130]
[null,null,"Legal Affairs",10250]
[null,null,"Levine Scholars Program",15140]
[null,null,"Library",25000]
[null,null,"Library Collection Services",25600]
[null,null,"Library Public Services",25100]
[null,null,"Library Spec Coll & Univ Archives",25500]
[null,null,"Library Tech & Digital Strategies",25700]
[null,null,"Mail Services",11100]
[null,null,"Maintenance and Operations",14100]
[null,null,"Major Gifts",30405]
[null,null,"Management",19900]
[null,null,"Marketing",20100]
[null,null,"Mathematics and Statistics",18500]
[null,null,"Mech Engineering & Engineering Sci",22000]
[null,null,"Men's Baseball",31100]
[null,null,"Men's Basketball",31000]
[null,null,"Men's Football",31050]
[null,null,"Men's Golf",31300]
[null,null,"Men's Soccer",31200]
[null,null,"Men's Tennis",31400]
[null,null,"Middle Grades, Secondary & K-12",21200]
[null,null,"Military Science",15600]
[null,null,"Millennial Campus, General",23450]
[null,null,"Mosaic Lab",21400]
[null,null,"Motorsports Engineering",22100]
[null,null,"Music",17900]
[null,null,"Niner Central",27250]
[null,null,"NinerTech Computer Store",29310]
[null,null,"Off of Adult Student/Evening Svc",27600]
[null,null,"Office of Fraternity&Sorority Life",29150]
[null,null,"OneIT-Academic Affairs Colleges",24208]
[null,null,"OneIT-Academic Affairs Units",24209]
[null,null,"OneIT-Business Services Technology",24207]
[null,null,"OneIT-CIO",24200]
[null,null,"OneIT-Client Engagement",24203]
[null,null,"OneIT-Enterprise Applications",24201]
[null,null,"OneIT-Enterprise Infrastructure",24202]
[null,null,"OneIT-Facilities Info Systems",13910]
[null,null,"OneIT-Financial Systems Support",12600]
[null,null,"OneIT-Planning & Administration",24204]
[null,null,"OneIT-Research Computing",24206]
[null,null,"OneIT-Stu Affairs/Adva/Athl",28401]
[null,null,"OneIT-Tech Operations & Planning",13000]
[null,null,"Optoelectronics Center",23600]
[null,null,"Organizational Science",19150]
[null,null,"Parking & Transportation Services",11200]
[null,null,"Performing Arts Services (PAS)",15215]
[null,null,"Philosophy",18600]
[null,null,"Physics and Optical Science",18800]
[null,null,"Planned Giv, Pub Event & Info",10275]
[null,null,"Planned Giving",30410]
[null,null,"Police and Public Safety",15000]
[null,null,"Political Science & Public Admin",19000]
[null,null,"PORTAL",23475]
[null,null,"Printing",11300]
[null,null,"Prospect Strategy & Research",30630]
[null,null,"Psychological Science",19100]
[null,null,"Public Health Sciences",22900]
[null,null,"Public Policy",18200]
[null,null,"R & ED Business Office",24425]
[null,null,"Reading & Elementary ED",21100]
[null,null,"Receiving and Stores",12800]
[null,null,"Recycling",14900]
[null,null,"Registrar",27200]
[null,null,"Religious Studies",19200]
[null,null,"Reprographics",10900]
[null,null,"Reputation Management & Comm",30525]
[null,null,"Research & Economic Dev. VC",24400]
[null,null,"Research Commercialization & Devel",24700]
[null,null,"Research Compliance",24650]
[null,null,"Research Services & Outreach",24800]
[null,null,"Residence Life Programs",29800]
[null,null,"SA Marketing & Communications",28402]
[null,null,"Safety and Security",13115]
[null,null,"SBTDC",30800]
[null,null,"School & Community Partnerships",20400]
[null,null,"School of Architecture",15200]
[null,null,"School of Data Science (SDS)",23950]
[null,null,"School of Nursing",22400]
[null,null,"School of Social Work",22800]
[null,null,"Social Media",30530]
[null,null,"Sociology",19300]
[null,null,"Software & Information Systems",23300]
[null,null,"Special Ed & Child Dev",21000]
[null,null,"Special Projects & Fundraising",30250]
[null,null,"Staff Organization",13201]
[null,null,"Staffing/Employment",13600]
[null,null,"Student Activity Ctr and Venue Mgmt",29500]
[null,null,"Student Affairs VC",28400]
[null,null,"Student Dev & Success",21600]
[null,null,"Student Engagement",29100]
[null,null,"Student Fee Commission",29200]
[null,null,"Student Government Association",29240]
[null,null,"Student Media",29230]
[null,null,"Student Union",29300]
[null,null,"Student Union Multicultural",29120]
[null,null,"Systems Engin & Engin Management",21305]
[null,null,"Teacher Ed, Adv & Lic Office",20700]
[null,null,"Teaching & Learning Connect - Admin",26150]
[null,null,"Theatre",17700]
[null,null,"Title IX Office",10260]
[null,null,"Training",13700]
[null,null,"Treasury Services",12200]
[null,null,"Turner School of Accountancy",19700]
[null,null,"UA Business Operations",30600]
[null,null,"UA Operations AVC",30675]
[null,null,"Undergraduate Admissions",27300]
[null,null,"Undergraduate Education",28390]
[null,null,"Undergraduate Programs",19550]
[null,null,"Univ Ctr for Acad Excellence",27500]
[null,null,"Univ Initiative Planning& Proj Mgmt",30520]
[null,null,"University Advancement VC",30200]
[null,null,"University Advising Center",28380]
[null,null,"University Career Center",27400]
[null,null,"University Communications AVC",30655]
[null,null,"University Development AVC",30400]
[null,null,"University Events",30680]
[null,null,"University Recreation",28900]
[null,null,"University Scholarship Office",27150]
[null,null,"Urban Institute",26400]
[null,null,"Urban Research & Comm Engagement",25900]
[null,null,"Vending",10800]
[null,null,"Venture",29110]
[null,null,"Ventureprise",30700]
[null,null,"Visual Media Communications",25800]
[null,null,"Wellness Promotion",30105]
[null,null,"Women's and Gender Studies",16800]
[null,null,"Women's Basketball",31500]
[null,null,"Women's Golf",31550]
[null,null,"Women's Lacrosse",31650]
[null,null,"Women's Soccer",31700]
[null,null,"Women's Softball",31600]
[null,null,"Women's Tennis",31900]
[null,null,"Women's Volleyball",31800]